BDBM50436670 CHEMBL2398172
SMILES OC(=O)c1cccc(n1)-c1ccc2CCC(=NNc3nc4ccccc4s3)c2c1
InChI Key InChIKey=BTUYDUATCAOFII-UHFFFAOYSA-N
Data  1 IC50
  Tab Delimited (TSV)   2D SDfile   Computed 3D by Vconf -m prep SDfile
Find this compound or compounds like it in BindingDB:
Activity Spreadsheet -- Enzyme Inhibition Constant Data from BindingDB
Found 1 hit for monomerid = 50436670
TargetBcl-2-like protein 1(Homo sapiens (Human))
The Walter And Eliza Hall Institute Of Medical Research
Curated by ChEMBL
LigandPNGBDBM50436670(CHEMBL2398172)
Affinity DataIC50:  130nM. Assay description: Binding affinity to human GST-tagged Bcl-Xl by luminescence proximity assay
In DepthDetails ArticlePubMed