BDBM50436688 CHEMBL2398473
SMILES CC(C)(C)C[C@@H]1N[C@H]([C@H](c2cccc(Cl)c2F)[C@]11C(=O)Nc2cc(Cl)ccc12)C(=O)N[C@H]1C[C@H](O)C1
InChI Key InChIKey=NLQIFYWAHULSET-CIGJFPSUSA-N
Data  1 KI  1 IC50
  Tab Delimited (TSV)   2D SDfile   Computed 3D by Vconf -m prep SDfile
Find this compound or compounds like it in BindingDB:
Activity Spreadsheet -- Enzyme Inhibition Constant Data from BindingDB
Found 2 hits for monomerid = 50436688
TargetE3 ubiquitin-protein ligase Mdm2(Homo sapiens (Human))
University Of Michigan
Curated by ChEMBL
LigandPNGBDBM50436688(CHEMBL2398473)
Affinity DataKi:  0.610nM. Assay description: Binding affinity to recombinant human His-tagged MDM2 (1 to 118 amino acids) using p53-based PMDM6-F as probe after 15 mins by competition assay
In DepthDetails ArticlePubMed
TargetE3 ubiquitin-protein ligase Mdm2(Homo sapiens (Human))
University Of Michigan
Curated by ChEMBL
LigandPNGBDBM50436688(CHEMBL2398473)
Affinity DataIC50:  7.10nM. Assay description: Binding affinity to recombinant human His-tagged MDM2 (1 to 118 amino acids) using p53-based PMDM6-F as probe after 15 to 30 mins by fluorescence pol...
In DepthDetails ArticlePubMed