BDBM50437037 CHEMBL2403068
SMILES COCCOc1cc(Nc2ncc(Cl)c(n2)-c2cccc(CC#N)c2)ccc1N1CCN(C)CC1
InChI Key InChIKey=KCKDYWFERPXFNA-UHFFFAOYSA-N
Data  1 IC50  1 EC50
  Tab Delimited (TSV)   2D SDfile   Computed 3D by Vconf -m prep SDfile
Find this compound or compounds like it in BindingDB:
Activity Spreadsheet -- Enzyme Inhibition Constant Data from BindingDB
Found 2 hits for monomerid = 50437037
TargetSerine/threonine-protein kinase PAK 1(Homo sapiens (Human))
Astex Pharmaceuticals
Curated by ChEMBL
LigandPNGBDBM50437037(CHEMBL2403068)
Affinity DataIC50:  2.88E+3nM. Assay description: Inhibition of human recombinant PAK1 using MBP as substrate by scintillation counting analysis in presence of [gamma-32P]ATP
In DepthDetails ArticlePubMed
TargetSerine/threonine-protein kinase PAK 1(Homo sapiens (Human))
Astex Pharmaceuticals
Curated by ChEMBL
LigandPNGBDBM50437037(CHEMBL2403068)
Affinity DataEC50:  9.14E+3nM. Assay description: Inhibition of PAK1 in human OVCAR3 cells assessed as MEK phosphorylation by TR-FRET assay
In DepthDetails ArticlePubMed