BDBM50437083 CHEMBL2403683
SMILES CC1CC1C(=O)N1CCc2nc(sc2C1)C#Cc1ccccc1
InChI Key InChIKey=UVAKOLFADYFKAQ-UHFFFAOYSA-N
Data  1 IC50  1 EC50
  Tab Delimited (TSV)   2D SDfile   Computed 3D by Vconf -m prep SDfile
Find this compound or compounds like it in BindingDB:
Activity Spreadsheet -- Enzyme Inhibition Constant Data from BindingDB
Found 2 hits for monomerid = 50437083
TargetMetabotropic glutamate receptor 5(Homo sapiens (Human))
Lundbeck Research Usa
Curated by ChEMBL
LigandPNGBDBM50437083(CHEMBL2403683)
Affinity DataEC50:  9.40nM. Assay description: Positive allosteric modulation of human mGlu5 receptor expressed in HEK293 cells assessed as potentiation of L-glutamate-induced activity after 1 hr ...
In DepthDetails ArticlePubMed
TargetMetabotropic glutamate receptor 5(Homo sapiens (Human))
Lundbeck Research Usa
Curated by ChEMBL
LigandPNGBDBM50437083(CHEMBL2403683)
Affinity DataIC50: >1.00E+4nM. Assay description: Negative allosteric modulation of human mGlu5 receptor expressed in HEK293 cells assessed as inhibition of L-glutamate-induced activity after 1 hr by...
In DepthDetails ArticlePubMed