BDBM50437109 CHEMBL2403682
SMILES O=C(C1CC1)N1CCc2nc(sc2C1)C#Cc1ccccc1
InChI Key InChIKey=JMCWYXPRTOXLSG-UHFFFAOYSA-N
Data  1 IC50  1 EC50
  Tab Delimited (TSV)   2D SDfile   Computed 3D by Vconf -m prep SDfile
Find this compound or compounds like it in BindingDB:
Activity Spreadsheet -- Enzyme Inhibition Constant Data from BindingDB
Found 2 hits for monomerid = 50437109
TargetMetabotropic glutamate receptor 5(Homo sapiens (Human))
Lundbeck Research Usa
Curated by ChEMBL
LigandPNGBDBM50437109(CHEMBL2403682)
Affinity DataIC50:  290nM. Assay description: Negative allosteric modulation of human mGlu5 receptor expressed in HEK293 cells assessed as inhibition of L-glutamate-induced activity after 1 hr by...
In DepthDetails ArticlePubMed
TargetMetabotropic glutamate receptor 5(Homo sapiens (Human))
Lundbeck Research Usa
Curated by ChEMBL
LigandPNGBDBM50437109(CHEMBL2403682)
Affinity DataEC50: >1.00E+4nM. Assay description: Positive allosteric modulation of human mGlu5 receptor expressed in HEK293 cells assessed as potentiation of L-glutamate-induced activity after 1 hr ...
In DepthDetails ArticlePubMed