BDBM50437155 CHEMBL2403813
SMILES CC(C)(C)c1cc(NC(=O)Nc2ccc(Nc3ncnc4ccc(cc34)[N+]([O-])=O)cc2)n(n1)-c1cccc(c1)[N+]([O-])=O
InChI Key InChIKey=KGKKAPCPGKWGNH-UHFFFAOYSA-N
Data  2 IC50
  Tab Delimited (TSV)   2D SDfile   Computed 3D by Vconf -m prep SDfile
Find this compound or compounds like it in BindingDB:
Activity Spreadsheet -- Enzyme Inhibition Constant Data from BindingDB
Found 2 hits for monomerid = 50437155
TargetProto-oncogene tyrosine-protein kinase Src(Gallus gallus (Chicken))
Technical University Of Dortmund
Curated by ChEMBL
LigandPNGBDBM50437155(CHEMBL2403813)
Affinity DataIC50:  34nM. Assay description: Inhibition of chicken wild-type cSRC (251 to 533)-mediated phosphorylation of biotinylated poly-Glu-Tyr expressed in Escherichia coli BL21(DE3) prein...
In DepthDetails ArticlePubMed
TargetTyrosine-protein kinase ABL1(Homo sapiens (Human))
Technical University Of Dortmund
Curated by ChEMBL
LigandPNGBDBM50437155(CHEMBL2403813)
Affinity DataIC50:  157nM. Assay description: Inhibition of human wild-type ABL (Ser229 to Gln513)-mediated phosphorylation of biotinylated poly-Glu-Tyr expressed in Escherichia coli BL21(DE3) pr...
In DepthDetails ArticlePubMed