BDBM50437265 CHEMBL2407256
SMILES CCN1CCN(CC1)c1ccc(NC(=O)c2ccc(cc2)-c2ccccn2)cc1
InChI Key InChIKey=ZSTGWKVANQXSPG-UHFFFAOYSA-N
Data  1 EC50
  Tab Delimited (TSV)   2D SDfile   Computed 3D by Vconf -m prep SDfile
Find this compound or compounds like it in BindingDB:
Activity Spreadsheet -- Enzyme Inhibition Constant Data from BindingDB
Found 1 hit for monomerid = 50437265
TargetMajor prion protein(Ovis aries)
University Of California
Curated by ChEMBL
LigandPNGBDBM50437265(CHEMBL2407256)
Affinity DataEC50:  365nM. Assay description: Antiprion activity against sheep prion infected in mouse ScN2a-cl3 cells assessed as reduction in PrPSc level after 5 days by ELISA
In DepthDetails ArticlePubMed