BDBM50437334 CHEMBL2407825
SMILES C[C@H](CCCC(C)(C)O)[C@H]1CC[C@H]2\C(CCC[C@]12C)=C\C=C1\C[C@@H](O)[C@H](CCn2ccnn2)[C@H](O)C1=C
InChI Key InChIKey=LTYQNQWQVDQXHT-RJAYHIQUSA-N
Data  1 EC50
  Tab Delimited (TSV)   2D SDfile   Computed 3D by Vconf -m prep SDfile
Find this compound or compounds like it in BindingDB:
Activity Spreadsheet -- Enzyme Inhibition Constant Data from BindingDB
Found 1 hit for monomerid = 50437334
TargetVitamin D3 receptor(Homo sapiens (Human))
Teikyo University
Curated by ChEMBL
LigandPNGBDBM50437334(CHEMBL2407825)
Affinity DataEC50:  0.210nM. Assay description: Transactivation of VDR-mediated osteocalcin promoter in human HOS/SF cells after 24 hrs by luciferase reporter gene assay
In DepthDetails ArticlePubMed