BDBM50437420 CHEMBL2409014
SMILES CCCCc1c(cnn1-c1ncc(C)c(n1)-c1cccs1)C(=O)NCc1cncn1CC(O)=O
InChI Key InChIKey=PSBCZUNMLKUTRI-UHFFFAOYSA-N
Data  1 EC50
  Tab Delimited (TSV)   2D SDfile   Computed 3D by Vconf -m prep SDfile
Find this compound or compounds like it in BindingDB:
Activity Spreadsheet -- Enzyme Inhibition Constant Data from BindingDB
Found 1 hit for monomerid = 50437420
TargetProbable G-protein coupled receptor 142(Homo sapiens (Human))
Daiichi Sankyo
Curated by ChEMBL
LigandPNGBDBM50437420(CHEMBL2409014)
Affinity DataEC50:  0.200nM. Assay description: Agonist activity at human GPR142 transfected in HEK293 cells after 1 hr by inositol phosphate accumulation assay
In DepthDetails ArticlePubMed