BDBM50437486 CHEMBL2409476
SMILES CCCNC(=O)[C@@H]1C[C@H]2CNC[C@H](C2)C1
InChI Key InChIKey=FEIJFKLKIQDCEV-UHFFFAOYSA-N
Data  2 KI  1 EC50
  Tab Delimited (TSV)   2D SDfile   Computed 3D by Vconf -m prep SDfile
Find this compound or compounds like it in BindingDB:
Activity Spreadsheet -- Enzyme Inhibition Constant Data from BindingDB
Found 3 hits for monomerid = 50437486
TargetNeuronal acetylcholine receptor subunit alpha-4/beta-2(Homo sapiens (Human))
Targacept
Curated by ChEMBL
LigandPNGBDBM50437486(CHEMBL2409476)
Affinity DataKi:  6nM. Assay description: Displacement of [3H]Nicotine from alpha4beta2 nACHR in human SHEP1 cell membranes after 2 hrs by liquid scintillation counting analysis
In DepthDetails ArticlePubMed
TargetNeuronal acetylcholine receptor subunit alpha-7(Homo sapiens (Human))
Targacept
Curated by ChEMBL
LigandPNGBDBM50437486(CHEMBL2409476)
Affinity DataKi:  1.00E+4nM. Assay description: Displacement of [3H]Epibatidine from human alpha7 nACHR expressed in CHO cell membranes after 2 hrs by liquid scintillation counting analysis
In DepthDetails ArticlePubMed
TargetNeuronal acetylcholine receptor subunit alpha-4/beta-2(Homo sapiens (Human))
Targacept
Curated by ChEMBL
LigandPNGBDBM50437486(CHEMBL2409476)
Affinity DataEC50:  2.40E+3nM. Assay description: Agonist activity at alpha4beta2 nACHR in human SHEP1 cell membranes assessed as stimulation of calcium flux by FLIPR assay
In DepthDetails ArticlePubMed