BDBM50438281 CHEMBL2408408
SMILES Clc1cccc(Nc2ncc3CCCCc3n2)c1
InChI Key InChIKey=UNVLQEQCDAGLMK-UHFFFAOYSA-N
Data  1 IC50
  Tab Delimited (TSV)   2D SDfile   Computed 3D by Vconf -m prep SDfile
Find this compound or compounds like it in BindingDB:
Activity Spreadsheet -- Enzyme Inhibition Constant Data from BindingDB
Found 1 hit for monomerid = 50438281
TargetMetabotropic glutamate receptor 5(Homo sapiens (Human))
Merz Pharmaceuticals
Curated by ChEMBL
LigandPNGBDBM50438281(CHEMBL2408408)
Affinity DataIC50:  452nM. Assay description: Negative allosteric modulation of human mGluR5 expressed in CHO cells assessed as inhibition of L-quisqualate-induced intracellular cAMP accumulation...
In DepthDetails ArticlePubMed