BDBM50438311 CHEMBL2408733
SMILES Cc1nn(C)c(C)c1-c1cnc(N)c2oc(cc12)-c1csc2cnccc12
InChI Key InChIKey=KQRHOCBFNKSFDP-UHFFFAOYSA-N
Data  2 IC50
  Tab Delimited (TSV)   2D SDfile   Computed 3D by Vconf -m prep SDfile
Find this compound or compounds like it in BindingDB:
Activity Spreadsheet -- Enzyme Inhibition Constant Data from BindingDB
Found 2 hits for monomerid = 50438311
TargetMitogen-activated protein kinase kinase kinase 7(Homo sapiens (Human))
Osi Pharmaceuticals
Curated by ChEMBL
LigandPNGBDBM50438311(CHEMBL2408733)
Affinity DataIC50:  4.40E+3nM. Assay description: Inhibition of TAK1 in human HCT116 cells assessed as inhibition of TNF-alpha-stimulated JNK phosphorylation
In DepthDetails ArticlePubMed
LigandPNGBDBM50438311(CHEMBL2408733)
Affinity DataIC50:  2.39E+4nM. Assay description: Inhibition of TAK1-TAB1 (unknown origin) by alphascreen assay in presence of ATP
In DepthDetails ArticlePubMed