BDBM50438400 CHEMBL2414163::US8637558, 85
SMILES OC1=NC(=O)C(S1)=Cc1ccc(OCc2ccccc2)cc1Cl
InChI Key InChIKey=LRUBWDZMLPTIIZ-UHFFFAOYSA-N
Data  2 IC50
  Tab Delimited (TSV)   2D SDfile   Computed 3D by Vconf -m prep SDfile
Find this compound or compounds like it in BindingDB:
Activity Spreadsheet -- Enzyme Inhibition Constant Data from BindingDB
Found 2 hits for monomerid = 50438400
Target15-hydroxyprostaglandin dehydrogenase [NAD(+)](Homo sapiens (Human))
Industry-Academic Cooperation Foundation, Chosun University
US Patent
LigandPNGBDBM50438400(CHEMBL2414163 | US8637558, 85)
Affinity DataIC50:  487nMpH: 7.5Assay Description:Experimental was performed by measuring the formation of NADH at 340 nm with a fluorescence spectrophotometer. Specifically, 2 ml (in total) of the s...
In DepthDetails US Patent
Target15-hydroxyprostaglandin dehydrogenase [NAD(+)](Homo sapiens (Human))
Industry-Academic Cooperation Foundation, Chosun University
US Patent
LigandPNGBDBM50438400(CHEMBL2414163 | US8637558, 85)
Affinity DataIC50:  487nM. Assay description: Inhibition of human GST-fused 15-PGDH expressed in Escherichia coli BL21 using PGE2 as substrate assessed as formation of NADH by fluorescence spectr...
In DepthDetails ArticlePubMed