BDBM50438503 CHEMBL2414819
SMILES OC[C@H]1O[C@@H](CNC(=O)\C=C\c2ccc(O)cc2)[C@H](O)[C@@H](O)[C@@H]1O
InChI Key InChIKey=GJNGKKXSDQXPSU-MRFAQVIFSA-N
Data  3 IC50
  Tab Delimited (TSV)   2D SDfile   Computed 3D by Vconf -m prep SDfile
Find this compound or compounds like it in BindingDB:
Activity Spreadsheet -- Enzyme Inhibition Constant Data from BindingDB
Found 3 hits for monomerid = 50438503
TargetLysosomal alpha-glucosidase(Rattus norvegicus)
Xi'An Jiaotong University
Curated by ChEMBL
LigandPNGBDBM50438503(CHEMBL2414819)
Affinity DataIC50:  3.69E+5nM. Assay description: Inhibition of rat intestinal maltase using maltose as substrate assessed as D-glucose release from substrate preincubated for 15 mins measured after ...
In DepthDetails ArticlePubMed
TargetSucrase-isomaltase, intestinal(Rattus norvegicus (Rat))
Xi'An Jiaotong University
Curated by ChEMBL
LigandPNGBDBM50438503(CHEMBL2414819)
Affinity DataIC50:  4.06E+5nM. Assay description: Inhibition of rat intestinal sucrase using sucrose as substrate assessed as D-glucose release from substrate preincubated for 15 mins measured after ...
In DepthDetails ArticlePubMed
TargetOligo-1,6-glucosidase IMA1(Saccharomyces cerevisiae S288c (Baker's yeast))
Xi'An Jiaotong University
Curated by ChEMBL
LigandPNGBDBM50438503(CHEMBL2414819)
Affinity DataIC50:  5.60E+3nM. Assay description: Inhibition of Saccharomyces cerevisiae alpha-glucosidase assessed as 4-nitrophenol release from 4-nitrophenyl alpha-D-glucopyranoside preincubated fo...
In DepthDetails ArticlePubMed