BDBM50438587 CHEMBL2413852
SMILES CC(=O)CC1CCN(CC1)C(=O)c1cc2ccccc2[nH]1
InChI Key InChIKey=AWTNCVWSLWPPIR-UHFFFAOYSA-N
Data  1 IC50
  Tab Delimited (TSV)   2D SDfile   Computed 3D by Vconf -m prep SDfile
Find this compound or compounds like it in BindingDB:
Activity Spreadsheet -- Enzyme Inhibition Constant Data from BindingDB
Found 1 hit for monomerid = 50438587
TargetAldo-keto reductase family 1 member C3(Homo sapiens (Human))
Astellas Pharma
Curated by ChEMBL
LigandPNGBDBM50438587(CHEMBL2413852)
Affinity DataIC50:  13nM. Assay description: Inhibition of human 17beta-HSD5 expressed in HEK293 cells using androstenedione as substrate assessed as testosterone synthesis after 4 hrs
In DepthDetails ArticlePubMed