BDBM50438614 CHEMBL2414197
SMILES COC(=O)C1=C\C=C(/CC\C(C)=C\CC\C(C)=C\CC\1)C(C)C
InChI Key InChIKey=JAXCRQBPGSFOHJ-ZPASOVNYSA-N
Data  1 IC50
  Tab Delimited (TSV)   2D SDfile   Computed 3D by Vconf -m prep SDfile
Find this compound or compounds like it in BindingDB:
Activity Spreadsheet -- Enzyme Inhibition Constant Data from BindingDB
Found 1 hit for monomerid = 50438614
TargetTyrosine-protein phosphatase non-receptor type 1(Homo sapiens (Human))
Chinese Academy Of Sciences
Curated by ChEMBL
LigandPNGBDBM50438614(CHEMBL2414197)
Affinity DataIC50:  5.95E+3nM. Assay description: Inhibition of human recombinant PTP1B-mediated pNPP hydrolysis
In DepthDetails ArticlePubMed