BDBM50438656 CHEMBL2414445
SMILES C(CCn1ccnc1)COc1ccccc1
InChI Key InChIKey=ODRFKWKSNLBXIO-UHFFFAOYSA-N
Data  4 IC50
  Tab Delimited (TSV)   2D SDfile   Computed 3D by Vconf -m prep SDfile
Find this compound or compounds like it in BindingDB:
Activity Spreadsheet -- Enzyme Inhibition Constant Data from BindingDB
Found 4 hits for monomerid = 50438656
TargetHeme oxygenase 2(Rattus norvegicus (rat))
University Of Catania
Curated by ChEMBL
LigandPNGBDBM50438656(CHEMBL2414445)
Affinity DataIC50:  3.00E+4nM. Assay description: Inhibition of Sprague-Dawley rat brain HO-2 assessed as bilirubin formation after 60 mins by spectrophotometric analysis
In DepthDetails ArticlePubMed
TargetHeme oxygenase 2(Rattus norvegicus (rat))
University Of Catania
Curated by ChEMBL
LigandPNGBDBM50438656(CHEMBL2414445)
Affinity DataIC50:  4.60E+3nM. Assay description: Inhibition of Sprague-Dawley rat brain microsome HO-2 preincubated for 10 mins followed by beta-NADPH addition and measured after 15 mins by gas chro...
In DepthDetails ArticlePubMed
TargetHeme oxygenase 1(Rattus norvegicus (rat))
University Of Catania
Curated by ChEMBL
LigandPNGBDBM50438656(CHEMBL2414445)
Affinity DataIC50:  4.00E+3nM. Assay description: Inhibition of Sprague-Dawley rat spleen microsome HO-1 preincubated for 10 mins followed by beta-NADPH addition and measured after 15 mins by gas chr...
In DepthDetails ArticlePubMed
TargetHeme oxygenase 1(Rattus norvegicus (rat))
University Of Catania
Curated by ChEMBL
LigandPNGBDBM50438656(CHEMBL2414445)
Affinity DataIC50:  2.10E+4nM. Assay description: Inhibition of Sprague-Dawley rat spleen microsomal HO-1 assessed as bilirubin formation after 60 mins by spectrophotometric analysis
In DepthDetails ArticlePubMed