BDBM50438710 CHEMBL2414661
SMILES Nc1ncnc2OCCN(c3ccc(cc3)C3CCN(CC3)C(=O)C3CCCCC3)C(=O)c12
InChI Key InChIKey=LREJWLKNQFZYRX-UHFFFAOYSA-N
Data  2 IC50
  Tab Delimited (TSV)   2D SDfile   Computed 3D by Vconf -m prep SDfile
Find this compound or compounds like it in BindingDB:
Activity Spreadsheet -- Enzyme Inhibition Constant Data from BindingDB
Found 2 hits for monomerid = 50438710
TargetDiacylglycerol O-acyltransferase 1(Homo sapiens (Human))
Pfizer
Curated by ChEMBL
LigandPNGBDBM50438710(CHEMBL2414661)
Affinity DataIC50:  85nM. Assay description: Inhibition of human full length DGAT-1 expressed in insect sf9 cells using [14C]decanoylCoA as substrate after 1.5 hrs by scintillation spectrometry
In DepthDetails ArticlePubMed
TargetDiacylglycerol O-acyltransferase 1(Homo sapiens (Human))
Pfizer
Curated by ChEMBL
LigandPNGBDBM50438710(CHEMBL2414661)
Affinity DataIC50:  514nM. Assay description: Inhibition of DGAT-1-mediated triglyceride synthesis in human HT-29 cells using [3H]-glycerol as substrate incubated for 1 hr prior to substrate addi...
In DepthDetails ArticlePubMed