BDBM50438741 CHEMBL2414679
SMILES OC(=O)C[C@H]1CC[C@@H](CC1)c1ccc(cc1)N1CCOc2nc[nH]c(=O)c2C1=O
InChI Key InChIKey=OLFUJHSJGGHZHG-HDJSIYSDSA-N
Data  1 IC50
  Tab Delimited (TSV)   2D SDfile   Computed 3D by Vconf -m prep SDfile
Find this compound or compounds like it in BindingDB:
Activity Spreadsheet -- Enzyme Inhibition Constant Data from BindingDB
Found 1 hit for monomerid = 50438741
TargetDiacylglycerol O-acyltransferase 1(Homo sapiens (Human))
Pfizer
Curated by ChEMBL
LigandPNGBDBM50438741(CHEMBL2414679)
Affinity DataIC50: >3.00E+3nM. Assay description: Inhibition of human full length DGAT-1 expressed in insect sf9 cells using [14C]decanoylCoA as substrate after 1.5 hrs by scintillation spectrometry
In DepthDetails ArticlePubMed