BDBM50438928 CHEMBL2420462
SMILES COc1ccc(cc1OC)-c1csc(NC(=O)c2ncc[nH]2)c1
InChI Key InChIKey=ZJIYUKAFROODIX-UHFFFAOYSA-N
Data  1 EC50
  Tab Delimited (TSV)   2D SDfile   Computed 3D by Vconf -m prep SDfile
Find this compound or compounds like it in BindingDB:
Activity Spreadsheet -- Enzyme Inhibition Constant Data from BindingDB
Found 1 hit for monomerid = 50438928
TargetTyrosyl-DNA phosphodiesterase 2(Homo sapiens (Human))
University Of Manchester
Curated by ChEMBL
LigandPNGBDBM50438928(CHEMBL2420462)
Affinity DataEC50: >3.00E+4nM. Assay description: Inhibition of TDP2 (unknown origin) using 4-nitrophenyl phenylphosphonate as substrate after 60 mins
In DepthDetails ArticlePubMed