BDBM50438947 CHEMBL2420618
SMILES Fc1ccc(cc1)S(=O)(=O)c1ccc(CNC(=O)c2cc3cnccc3[nH]2)cc1
InChI Key InChIKey=DVPNRFVZJMAEBA-UHFFFAOYSA-N
Data  1 IC50
  Tab Delimited (TSV)   2D SDfile   Computed 3D by Vconf -m prep SDfile
Find this compound or compounds like it in BindingDB:
Activity Spreadsheet -- Enzyme Inhibition Constant Data from BindingDB
Found 1 hit for monomerid = 50438947
TargetNicotinamide phosphoribosyltransferase(Homo sapiens (Human))
Forma Therapeutics
Curated by ChEMBL
LigandPNGBDBM50438947(CHEMBL2420618)
Affinity DataIC50:  17nM. Assay description: Inhibition of C-terminal His-tagged NAMPT (unknown origin) expressed in Escherichia coli BL21 using nicotinamide as substrate preincubated for 15 min...
In DepthDetails ArticlePubMed