BDBM50439009 CHEMBL2420813
SMILES COC(=O)Nc1cc(NC(=O)c2c(Cl)cccc2Cl)ccn1
InChI Key InChIKey=CORRJCPCJOZABB-UHFFFAOYSA-N
Data  2 KI
  Tab Delimited (TSV)   2D SDfile   Computed 3D by Vconf -m prep SDfile
Find this compound or compounds like it in BindingDB:
Activity Spreadsheet -- Enzyme Inhibition Constant Data from BindingDB
Found 2 hits for monomerid = 50439009
TargetTyrosine-protein kinase JAK2(Homo sapiens (Human))
Genentech
Curated by ChEMBL
LigandPNGBDBM50439009(CHEMBL2420813)
Affinity DataKi:  610nM. Assay description: Inhibition of JAK2 (unknown origin)
In DepthDetails ArticlePubMed
TargetTyrosine-protein kinase JAK1(Homo sapiens (Human))
Genentech
Curated by ChEMBL
LigandPNGBDBM50439009(CHEMBL2420813)
Affinity DataKi:  2.60E+3nM. Assay description: Inhibition of JAK1 (unknown origin)
In DepthDetails ArticlePubMed