BDBM50439016 CHEMBL2420832
SMILES CCC(=O)Nc1cc(NC(=O)c2c(Cl)cccc2Cl)ccn1
InChI Key InChIKey=CEJFWHOOEUEYOE-UHFFFAOYSA-N
Data  2 KI
  Tab Delimited (TSV)   2D SDfile   Computed 3D by Vconf -m prep SDfile
Find this compound or compounds like it in BindingDB:
Activity Spreadsheet -- Enzyme Inhibition Constant Data from BindingDB
Found 2 hits for monomerid = 50439016
TargetTyrosine-protein kinase JAK2(Homo sapiens (Human))
Genentech
Curated by ChEMBL
LigandPNGBDBM50439016(CHEMBL2420832)
Affinity DataKi:  250nM. Assay description: Inhibition of JAK2 (unknown origin)
In DepthDetails ArticlePubMed
TargetTyrosine-protein kinase JAK1(Homo sapiens (Human))
Genentech
Curated by ChEMBL
LigandPNGBDBM50439016(CHEMBL2420832)
Affinity DataKi:  2.40E+3nM. Assay description: Inhibition of JAK1 (unknown origin)
In DepthDetails ArticlePubMed