BDBM50439206 CHEMBL2418785
SMILES C(Sc1nnc(o1)-c1ccc2nc[nH]c2c1)c1ccncc1
InChI Key InChIKey=CRIWNHJPYAHSBX-UHFFFAOYSA-N
Data  1 KI
  Tab Delimited (TSV)   2D SDfile   Computed 3D by Vconf -m prep SDfile
Find this compound or compounds like it in BindingDB:
Activity Spreadsheet -- Enzyme Inhibition Constant Data from BindingDB
Found 1 hit for monomerid = 50439206
TargetGlutaminyl-peptide cyclotransferase(Homo sapiens (Human))
Probiodrug
Curated by ChEMBL
LigandPNGBDBM50439206(CHEMBL2418785)
Affinity DataKi:  1.01E+3nM. Assay description: Inhibition of human glutaminyl cyclase expressed in Escherichia coli DH5alpha using H-Gln-AMC as substrate by fluorometric analysis in presence of py...
In DepthDetails ArticlePubMed