BDBM50439255 CHEMBL2419040
SMILES CC(C)C[C@@H](NC(=O)[C@@H]1CNC[C@@H](C1)N1CC(=O)N(CC1(C)C)c1ccccc1Cl)c1ccc(F)cn1
InChI Key InChIKey=ARAQVWPNKFJBQQ-XZDHIHRUSA-N
Data  2 IC50
  Tab Delimited (TSV)   2D SDfile   Computed 3D by Vconf -m prep SDfile
Find this compound or compounds like it in BindingDB:
Activity Spreadsheet -- Enzyme Inhibition Constant Data from BindingDB
Found 2 hits for monomerid = 50439255
TargetRenin(Homo sapiens (Human))
Daiichi Sankyo
Curated by ChEMBL
LigandPNGBDBM50439255(CHEMBL2419040)
Affinity DataIC50:  1nM. Assay description: Inhibition of trypsin-activated human recombinant renin using (Arg-Glu(EDANS)-Ile-His-Pro-Phe-His-Leu-Val-Ile-His-Thr-Lys(DABCYL)-Arg) as substrate i...
In DepthDetails ArticlePubMed
TargetRenin(Macaca fascicularis)
Daiichi Sankyo
Curated by ChEMBL
LigandPNGBDBM50439255(CHEMBL2419040)
Affinity DataIC50:  9.70nM. Assay description: Inhibition of cynomolgus monkey plasma renin assessed as angiotensin 1 level after 60 mins by competitive radioimmunoassay
In DepthDetails ArticlePubMed