BDBM50439338 CHEMBL2420335
SMILES OC(=O)CCCn1ccc(=O)[nH]c1=O
InChI Key InChIKey=QUNMTFIUXOCVPQ-UHFFFAOYSA-N
Data  1 KI
  Tab Delimited (TSV)   2D SDfile   Computed 3D by Vconf -m prep SDfile
Find this compound or compounds like it in BindingDB:
Activity Spreadsheet -- Enzyme Inhibition Constant Data from BindingDB
Found 1 hit for monomerid = 50439338
TargetDeoxyuridine 5'-triphosphate nucleotidohydrolase, mitochondrial(Homo sapiens (Human))
University Of Dundee
Curated by ChEMBL
LigandPNGBDBM50439338(CHEMBL2420335)
Affinity DataKi:  1.00E+6nM. Assay description: Inhibition of recombinant human dUTPase expressed in Escherichia coli BL21 (DE3) using dUTP as substrate by spectrophotometric analysis
In DepthDetails ArticlePubMed