BDBM50439360 CHEMBL2420397
SMILES COC(=O)c1nn(CCc2ccccc2)cc1NC(=O)CCc1ccccc1
InChI Key InChIKey=NWRGKEXTHLEOQX-UHFFFAOYSA-N
Data  1 EC50
  Tab Delimited (TSV)   2D SDfile   Computed 3D by Vconf -m prep SDfile
Find this compound or compounds like it in BindingDB:
Activity Spreadsheet -- Enzyme Inhibition Constant Data from BindingDB
Found 1 hit for monomerid = 50439360
TargetTumor necrosis factor receptor superfamily member 6(Rattus norvegicus)
Chungnam National University
Curated by ChEMBL
LigandPNGBDBM50439360(CHEMBL2420397)
Affinity DataEC50:  427nM. Assay description: Inhibition of Fas-mediated cell death in oxygen and glucose deprived rat H9c2 cells treated 30 mins before oxygen and glucose deprivation measured af...
In DepthDetails ArticlePubMed