BDBM50439384 CHEMBL2420407
SMILES COC(=O)c1cc(Br)cc(Br)c1NC(=O)C(Sc1ccc(Br)cc1)c1ccccc1
InChI Key InChIKey=IFHYKUGAUXMBGA-UHFFFAOYSA-N
Data  1 EC50
  Tab Delimited (TSV)   2D SDfile   Computed 3D by Vconf -m prep SDfile
Find this compound or compounds like it in BindingDB:
Activity Spreadsheet -- Enzyme Inhibition Constant Data from BindingDB
Found 1 hit for monomerid = 50439384
TargetTumor necrosis factor receptor superfamily member 6(Rattus norvegicus)
Chungnam National University
Curated by ChEMBL
LigandPNGBDBM50439384(CHEMBL2420407)
Affinity DataEC50:  1.59E+3nM. Assay description: Inhibition of Fas-mediated cell death in oxygen and glucose deprived rat H9c2 cells treated 30 mins before oxygen and glucose deprivation measured af...
In DepthDetails ArticlePubMed