BDBM50439465 CHEMBL2420904
SMILES OC(=O)C1CCC2(CCN(CC2)c2ncnc3nc[nH]c23)NC1
InChI Key InChIKey=DKDRBYGOIPHLMM-UHFFFAOYSA-N
Data  1 IC50
  Tab Delimited (TSV)   2D SDfile   Computed 3D by Vconf -m prep SDfile
Find this compound or compounds like it in BindingDB:
Activity Spreadsheet -- Enzyme Inhibition Constant Data from BindingDB
Found 1 hit for monomerid = 50439465
TargetAurora kinase A(Homo sapiens (Human))
The Institute Of Cancer Research
Curated by ChEMBL
LigandPNGBDBM50439465(CHEMBL2420904)
Affinity DataIC50:  6.10E+3nM. Assay description: Inhibition of AURA (unknown origin) by microfluidic mobility shift assay
In DepthDetails ArticlePubMed