BDBM50439669 CHEMBL2419815
SMILES C[C@@H]1OC(=O)[C@@H]1NC(=O)OC1CCC(Cc2ccccc2)CC1
InChI Key InChIKey=QNWDMPXQYBUVNW-HOJRLLLISA-N
Data  1 IC50
  Tab Delimited (TSV)   2D SDfile   Computed 3D by Vconf -m prep SDfile
Find this compound or compounds like it in BindingDB:
Activity Spreadsheet -- Enzyme Inhibition Constant Data from BindingDB
Found 1 hit for monomerid = 50439669
TargetN-acylethanolamine-hydrolyzing acid amidase(Rattus norvegicus (Rat))
Istituto Italiano Di Tecnologia
Curated by ChEMBL
LigandPNGBDBM50439669(CHEMBL2419815)
Affinity DataIC50:  310nM. Assay description: Inhibition of Sprague Dawley rat lung native NAAA enzyme using heptadecenoylethanolamide as substrate preincubated for 30 mins followed by substrate ...
In DepthDetails ArticlePubMed