BDBM50440185 CHEMBL2426616
SMILES CN1CCc2nc(COc3ccccc3)sc2C1=O
InChI Key InChIKey=AOOAPFRKSGWOER-UHFFFAOYSA-N
Data  8 EC50
  Tab Delimited (TSV)   2D SDfile   Computed 3D by Vconf -m prep SDfile
Find this compound or compounds like it in BindingDB:
Activity Spreadsheet -- Enzyme Inhibition Constant Data from BindingDB
Found 8 hits for monomerid = 50440185
TargetMetabotropic glutamate receptor 1(Homo sapiens (Human))
Janssen Pharmaceutica
Curated by ChEMBL
LigandPNGBDBM50440185(CHEMBL2426616)
Affinity DataEC50: >1.00E+4nM. Assay description: Positive allosteric modulation of human mGlu1 receptor expressed in HEK293 cells by fluorescent Ca2+ assay
In DepthDetails ArticlePubMed
TargetMetabotropic glutamate receptor 2(Homo sapiens (Human))
Janssen Pharmaceutica
Curated by ChEMBL
LigandPNGBDBM50440185(CHEMBL2426616)
Affinity DataEC50: >1.00E+4nM. Assay description: Positive allosteric modulation of human mGlu2 receptor expressed in HEK293 cells by fluorescent Ca2+ assay
In DepthDetails ArticlePubMed
TargetMetabotropic glutamate receptor 3(Homo sapiens (Human))
Janssen Pharmaceutica
Curated by ChEMBL
LigandPNGBDBM50440185(CHEMBL2426616)
Affinity DataEC50: >1.00E+4nM. Assay description: Positive allosteric modulation of human mGlu3 receptor expressed in HEK293 cells by fluorescent Ca2+ assay
In DepthDetails ArticlePubMed
TargetMetabotropic glutamate receptor 7(Homo sapiens (Human))
Janssen Pharmaceutica
Curated by ChEMBL
LigandPNGBDBM50440185(CHEMBL2426616)
Affinity DataEC50: >1.00E+4nM. Assay description: Positive allosteric modulation of human mGlu7 receptor expressed in HEK293 cells by fluorescent Ca2+ assay
In DepthDetails ArticlePubMed
TargetMetabotropic glutamate receptor 4(Homo sapiens (Human))
Janssen Pharmaceutica
Curated by ChEMBL
LigandPNGBDBM50440185(CHEMBL2426616)
Affinity DataEC50: >1.00E+4nM. Assay description: Positive allosteric modulation of human mGlu4 receptor expressed in HEK293 cells by fluorescent Ca2+ assay
In DepthDetails ArticlePubMed
TargetMetabotropic glutamate receptor 8(Homo sapiens (Human))
Janssen Pharmaceutica
Curated by ChEMBL
LigandPNGBDBM50440185(CHEMBL2426616)
Affinity DataEC50: >1.00E+4nM. Assay description: Positive allosteric modulation of human mGlu8 receptor expressed in HEK293 cells by fluorescent Ca2+ assay
In DepthDetails ArticlePubMed
TargetMetabotropic glutamate receptor 5(Homo sapiens (Human))
Janssen Pharmaceutica
Curated by ChEMBL
LigandPNGBDBM50440185(CHEMBL2426616)
Affinity DataEC50:  1.20E+3nM. Assay description: Positive allosteric modulation of human mGluR5a transfected in HEK293 cells by calcium mobilization assay
In DepthDetails ArticlePubMed
TargetMetabotropic glutamate receptor 5(Homo sapiens (Human))
Janssen Pharmaceutica
Curated by ChEMBL
LigandPNGBDBM50440185(CHEMBL2426616)
Affinity DataEC50:  1.20E+3nM. Assay description: Positive allosteric modulation of human mGluR5a transfected in HEK293 cells by calcium mobilization assay
In DepthDetails ArticlePubMed