BDBM50440498 CHEMBL2426143
SMILES CC(C)(C(c1ccccc1)c1ccc2c(ncn2c1)-c1ccc(cc1)C#N)C(=O)Nc1nccs1
InChI Key InChIKey=MEIHUCGFGMXGHM-UHFFFAOYSA-N
Data  1 KI  2 EC50
  Tab Delimited (TSV)   2D SDfile   Computed 3D by Vconf -m prep SDfile
Find this compound or compounds like it in BindingDB:
Activity Spreadsheet -- Enzyme Inhibition Constant Data from BindingDB
Found 3 hits for monomerid = 50440498
TargetGlucocorticoid receptor(Homo sapiens (Human))
Bristol-Myers Squibb
Curated by ChEMBL
LigandPNGBDBM50440498(CHEMBL2426143)
Affinity DataKi:  4nM. Assay description: Binding affinity to glucocorticoid receptor-LBD (unknown origin) by fluorescence polarization assay
In DepthDetails ArticlePubMed
TargetGlucocorticoid receptor(Homo sapiens (Human))
Bristol-Myers Squibb
Curated by ChEMBL
LigandPNGBDBM50440498(CHEMBL2426143)
Affinity DataEC50: >1.00E+4nM. Assay description: Transactivation of GR-LBD expressed in human HeLa cells co-expressing GAL4-DBD by luciferase reporter gene assay
In DepthDetails ArticlePubMed
TargetGlucocorticoid receptor(Homo sapiens (Human))
Bristol-Myers Squibb
Curated by ChEMBL
LigandPNGBDBM50440498(CHEMBL2426143)
Affinity DataEC50:  89nM. Assay description: Transrepression of glucocorticoid receptor in human A549 cells assessed as inhibition of PMA-induced AP-1 activity by luciferase reporter gene assay
In DepthDetails ArticlePubMed