BDBM50440682 CHEMBL2430769
SMILES COc1cc(\C=C\c2nnc(o2)-c2ccccc2Cl)cc(OC)c1OC
InChI Key InChIKey=LOECOEFDAUWNEW-CMDGGOBGSA-N
Data  1 IC50
  Tab Delimited (TSV)   2D SDfile   Computed 3D by Vconf -m prep SDfile
Find this compound or compounds like it in BindingDB:
Activity Spreadsheet -- Enzyme Inhibition Constant Data from BindingDB
Found 1 hit for monomerid = 50440682
TargetAcetylcholinesterase(Electrophorus electricus (Electric eel))TBA
LigandPNGBDBM50440682(CHEMBL2430769)
Affinity DataIC50:  5.81E+4nM. Assay description: Inhibition of electric eel AChE using acetylthiocholine as substrate incubated for 20 mins prior to substrate addition measured every 30 secs for 4 m...
In DepthDetails Article