BDBM50440697 CHEMBL2430980
SMILES CNc1cc(ccn1)-c1cc(NC(=O)[C@H](Cc2ccc(F)cc2)NCc2nnn[nH]2)n(C)n1
InChI Key InChIKey=FSRJXBPPZZQUBH-KRWDZBQOSA-N
Data  1 EC50
  Tab Delimited (TSV)   2D SDfile   Computed 3D by Vconf -m prep SDfile
Find this compound or compounds like it in BindingDB:
Activity Spreadsheet -- Enzyme Inhibition Constant Data from BindingDB
Found 1 hit for monomerid = 50440697
TargetProbable G-protein coupled receptor 142(Homo sapiens (Human))
Amgen
Curated by ChEMBL
LigandPNGBDBM50440697(CHEMBL2430980)
Affinity DataEC50:  71nM. Assay description: Agonist activity at human GPR142 expressed in HEK293 cells assessed as inositol phosphate accumulation using [3H]-inositol after 1 hr by scintillatio...
In DepthDetails ArticlePubMed