BDBM50440702 CHEMBL2431059
SMILES O=C(Nc1nc(cs1)-c1ccncc1)[C@H](Cc1ccccc1)NCc1cncs1
InChI Key InChIKey=JREYUFKOFBWOPD-SFHVURJKSA-N
Data  2 EC50
  Tab Delimited (TSV)   2D SDfile   Computed 3D by Vconf -m prep SDfile
Find this compound or compounds like it in BindingDB:
Activity Spreadsheet -- Enzyme Inhibition Constant Data from BindingDB
Found 2 hits for monomerid = 50440702
TargetProbable G-protein coupled receptor 142(Homo sapiens (Human))
Amgen
Curated by ChEMBL
LigandPNGBDBM50440702(CHEMBL2431059)
Affinity DataEC50:  1.08E+3nM. Assay description: Agonist activity at human GPR142 expressed in HEK293 cells assessed as inositol phosphate accumulation using [3H]-inositol after 1 hr by scintillatio...
In DepthDetails ArticlePubMed
TargetProbable G-protein coupled receptor 142(Homo sapiens (Human))
Amgen
Curated by ChEMBL
LigandPNGBDBM50440702(CHEMBL2431059)
Affinity DataEC50:  1.11E+3nM. Assay description: Agonist activity at human GPR142 expressed in HEK293 cells assessed as inositol phosphate accumulation using [3H]-inositol after 1 hr by scintillatio...
In DepthDetails ArticlePubMed