BDBM50440735 CHEMBL2431092
SMILES CCNC(=O)C[C@H]1N=C(c2c(C)c(C)sc2-c2c(C)noc12)c1ccc(Cl)cc1
InChI Key InChIKey=BEBIPBFPYIYAQJ-MRXNPFEDSA-N
Data  1 IC50
  Tab Delimited (TSV)   2D SDfile   Computed 3D by Vconf -m prep SDfile
Find this compound or compounds like it in BindingDB:
Activity Spreadsheet -- Enzyme Inhibition Constant Data from BindingDB
Found 1 hit for monomerid = 50440735
TargetBromodomain-containing protein 4(Homo sapiens (Human))
Constellation Pharmaceuticals
Curated by ChEMBL
LigandPNGBDBM50440735(CHEMBL2431092)
Affinity DataIC50:  2.10E+3nM. Assay description: Inhibition of His-FLAG-tagged BRD4 binding domain1 (unknown origin) binding to H4-TetraAc-biotin peptide after 20 mins by AlphaLISA
In DepthDetails ArticlePubMed