BDBM50440966 CHEMBL2431981
SMILES Cc1ccc(cc1)S(=O)(=O)NCC(=O)Nc1ccc(C(O)=O)c(O)c1
InChI Key InChIKey=LBVFAUSNJUGZPR-UHFFFAOYSA-N
Data  1 IC50
  Tab Delimited (TSV)   2D SDfile   Computed 3D by Vconf -m prep SDfile
Find this compound or compounds like it in BindingDB:
Activity Spreadsheet -- Enzyme Inhibition Constant Data from BindingDB
Found 1 hit for monomerid = 50440966
TargetSignal transducer and activator of transcription 3(Homo sapiens (Human))
University Of Toronto Mississauga
Curated by ChEMBL
LigandPNGBDBM50440966(CHEMBL2431981)
Affinity DataIC50: >3.00E+5nM. Assay description: Binding affinity to Stat3 (unknown origin) using hSIE as probe preincubated for 30 mins followed by hSIE addition by electrophoretic mobility shift a...
In DepthDetails ArticlePubMed