BDBM50441239 CHEMBL2431338
SMILES OC(=O)CC[C@H](NC(=O)N[C@@H](CSC1CC(=O)N(CCCCCNC(=O)CNC(=O)c2cccc(I)c2)C1=O)C(O)=O)C(O)=O
InChI Key InChIKey=SFLMEXCPNWBKAI-ADUPEVMXSA-N
Data  1 KI
  Tab Delimited (TSV)   2D SDfile   Computed 3D by Vconf -m prep SDfile
Find this compound or compounds like it in BindingDB:
Activity Spreadsheet -- Enzyme Inhibition Constant Data from BindingDB
Found 1 hit for monomerid = 50441239
TargetGlutamate carboxypeptidase 2(Homo sapiens (Human))
Kyoto University
Curated by ChEMBL
LigandPNGBDBM50441239(CHEMBL2431338)
Affinity DataKi:  7.90nM. Assay description: Displacement of [123I]-DCIT from PSMA in human LNCaP cells after 1 hr by gamma counting
In DepthDetails ArticlePubMed