BDBM50441764 CHEMBL2436003
SMILES CC(C)Cc1nc(-c2c[nH]c(=O)c(Cl)c2)n(n1)-c1cccc2OCCOc12
InChI Key InChIKey=ADJRVHQGKHBURM-UHFFFAOYSA-N
Data  1 IC50
  Tab Delimited (TSV)   2D SDfile   Computed 3D by Vconf -m prep SDfile
Find this compound or compounds like it in BindingDB:
Activity Spreadsheet -- Enzyme Inhibition Constant Data from BindingDB
Found 1 hit for monomerid = 50441764
TargetBromodomain-containing protein 4(Homo sapiens (Human))
The Institute Of Cancer Research
Curated by ChEMBL
LigandPNGBDBM50441764(CHEMBL2436003)
Affinity DataIC50:  7.70E+4nM. Assay description: Inhibition of His-tagged first bromodomain of BRD4 (unknown origin) using H-SGRGK(Ac)GGK(Ac)GLGK-(Ac)GGAK(Ac)RHRK(Biotin)-OH as substrate preincubate...
In DepthDetails ArticlePubMed