BDBM50441782 CHEMBL2436040
SMILES OC(=O)c1cc(NC(=O)c2nc(sc2-c2ccccc2)[C@H](Cc2ccc(OCc3ccccc3)cc2)NC(=O)CCc2c[nH]c3ccccc23)ccc1F
InChI Key InChIKey=OHFHNJBBMDHQRR-QNGWXLTQSA-N
Data  1 IC50
  Tab Delimited (TSV)   2D SDfile   Computed 3D by Vconf -m prep SDfile
Find this compound or compounds like it in BindingDB:
Activity Spreadsheet -- Enzyme Inhibition Constant Data from BindingDB
Found 1 hit for monomerid = 50441782
TargetTyrosine-protein phosphatase non-receptor type 1(Homo sapiens (Human))
Chinese Academy Of Sciences
Curated by ChEMBL
LigandPNGBDBM50441782(CHEMBL2436040)
Affinity DataIC50:  1.62E+3nM. Assay description: Inhibition of GST-tagged PTP1B (unknown origin) using pNPP as substrate measured for 2 mins by colorimetric analysis
In DepthDetails ArticlePubMed