BDBM50441905 CHEMBL2437035
SMILES CCn1c(ccc1C(CC)(CC)c1ccc(OCC(=O)C(C)(C)C)c(C)c1)C(=O)NCC(=O)OC
InChI Key InChIKey=QOCBZTBLZFXNER-UHFFFAOYSA-N
Data  1 EC50
  Tab Delimited (TSV)   2D SDfile   Computed 3D by Vconf -m prep SDfile
Find this compound or compounds like it in BindingDB:
Activity Spreadsheet -- Enzyme Inhibition Constant Data from BindingDB
Found 1 hit for monomerid = 50441905
TargetVitamin D3 receptor(Homo sapiens (Human))
China Pharmaceutical University
Curated by ChEMBL
LigandPNGBDBM50441905(CHEMBL2437035)
Affinity DataEC50:  1.83E+3nM. Assay description: Agonist activity at VDR in human HL60 cells assessed as induction of cell differentiation after 96 hrs by NBT reduction assay
In DepthDetails ArticlePubMed