BDBM50442095 CHEMBL2441056
SMILES Fc1ccc(COc2cccc(NC(=O)C3CCN(CC3)c3ccncc3)c2)c(F)c1
InChI Key InChIKey=TVXVXAIQFKCTHU-UHFFFAOYSA-N
Data  2 KI
  Tab Delimited (TSV)   2D SDfile   Computed 3D by Vconf -m prep SDfile
Find this compound or compounds like it in BindingDB:
Activity Spreadsheet -- Enzyme Inhibition Constant Data from BindingDB
Found 2 hits for monomerid = 50442095
TargetProthrombin(Bos taurus (Bovine))
University Of Bari &Quot;Aldo Moro&Quot
Curated by ChEMBL
LigandPNGBDBM50442095(CHEMBL2441056)
Affinity DataKi:  4.64E+3nM. Assay description: Inhibition of bovine thrombin using D-Phe-Pip-Arg-p-NA as substrate by chromogenic assay
In DepthDetails ArticlePubMed
TargetCoagulation factor X(Homo sapiens (Human))
University Of Bari &Quot;Aldo Moro&Quot
Curated by ChEMBL
LigandPNGBDBM50442095(CHEMBL2441056)
Affinity DataKi:  8.80E+3nM. Assay description: Inhibition of human factor 10a using Z-D-Arg-Gly-Arg-p-NA as substrate by chromogenic assay
In DepthDetails ArticlePubMed