BDBM50442151 CHEMBL2441286
SMILES COc1ccc2nc(Nc3cc(nc(N[C@H]4CC[C@H](O)CC4)n3)C(F)(F)c3ccc(F)cc3)sc2c1
InChI Key InChIKey=YSUBPTBQVXDZFZ-QAQDUYKDSA-N
Data  2 KI
  Tab Delimited (TSV)   2D SDfile   Computed 3D by Vconf -m prep SDfile
Find this compound or compounds like it in BindingDB:
Activity Spreadsheet -- Enzyme Inhibition Constant Data from BindingDB
Found 2 hits for monomerid = 50442151
TargetTyrosine-protein kinase ITK/TSK(Homo sapiens (Human))
Glaxosmithkline
Curated by ChEMBL
LigandPNGBDBM50442151(CHEMBL2441286)
Affinity DataKi:  20nM. Assay description: Inhibition of recombinant human FLAG-tagged ITK using biotinylated GST-SAM68 as substrate after 30 mins
In DepthDetails ArticlePubMed
TargetAurora kinase B(Homo sapiens (Human))
Glaxosmithkline
Curated by ChEMBL
LigandPNGBDBM50442151(CHEMBL2441286)
Affinity DataKi:  2.51E+3nM. Assay description: Inhibition of Aurora-B (unknown origin) using 5FAM-PKAtide as substrate after 120 mins
In DepthDetails ArticlePubMed