BDBM50442348 CHEMBL2442779
SMILES COc1ccc(NC(=O)C[C@H]2N[C@@H](C)[C@@H](O)[C@@H](O)[C@@H]2O)cc1
InChI Key InChIKey=SBHQBODSTOEYJS-ZZVMUTNWSA-N
Data  3 IC50
  Tab Delimited (TSV)   2D SDfile   Computed 3D by Vconf -m prep SDfile
Find this compound or compounds like it in BindingDB:
Activity Spreadsheet -- Enzyme Inhibition Constant Data from BindingDB
Found 3 hits for monomerid = 50442348
TargetTissue alpha-L-fucosidase(Homo sapiens (Human))
University Of Toyama
Curated by ChEMBL
LigandPNGBDBM50442348(CHEMBL2442779)
Affinity DataIC50:  26nM. Assay description: Inhibition of human lysosome alpha-L-fucosidase using 4-methylumbelliferyl-alpha-L-fucopyranoside by spectrophotometry
In DepthDetails ArticlePubMed
TargetTissue alpha-L-fucosidase(Bos taurus)
University Of Toyama
Curated by ChEMBL
LigandPNGBDBM50442348(CHEMBL2442779)
Affinity DataIC50:  43nM. Assay description: Inhibition of bovine kidney alpha-L-fucosidase assessed as inhibition of release of p-nitrophenol by spectrophotometry
In DepthDetails ArticlePubMed
TargetTissue alpha-L-fucosidase(Rattus norvegicus)
University Of Toyama
Curated by ChEMBL
LigandPNGBDBM50442348(CHEMBL2442779)
Affinity DataIC50:  170nM. Assay description: Inhibition of rat epididymis alpha-L-fucosidase assessed as inhibition of release of p-nitrophenol by spectrophotometry
In DepthDetails ArticlePubMed