BDBM50442459 CHEMBL2443113
SMILES Cc1cccnc1CN1CCC2(CCN(C2=O)c2ccc(cc2C#N)-c2ccccc2)CC1
InChI Key InChIKey=QSCSYJZGIMURRQ-UHFFFAOYSA-N
Data  1 IC50
  Tab Delimited (TSV)   2D SDfile   Computed 3D by Vconf -m prep SDfile
Find this compound or compounds like it in BindingDB:
Activity Spreadsheet -- Enzyme Inhibition Constant Data from BindingDB
Found 1 hit for monomerid = 50442459
TargetEgl nine homolog 1(Homo sapiens (Human))
Glaxosmithkline
Curated by ChEMBL
LigandPNGBDBM50442459(CHEMBL2443113)
Affinity DataIC50:  40nM. Assay description: Inhibition of PHD2 (unknown origin) by HTRF assay
In DepthDetails ArticlePubMed