BDBM50442464 CHEMBL2443128
SMILES Cc1cccnc1CN1CCC2(CCN(C2=O)c2ccc(nc2)-c2ccccc2)CC1
InChI Key InChIKey=FOFBYGHDKURTMS-UHFFFAOYSA-N
Data  1 IC50
  Tab Delimited (TSV)   2D SDfile   Computed 3D by Vconf -m prep SDfile
Find this compound or compounds like it in BindingDB:
Activity Spreadsheet -- Enzyme Inhibition Constant Data from BindingDB
Found 1 hit for monomerid = 50442464
TargetEgl nine homolog 1(Homo sapiens (Human))
Glaxosmithkline
Curated by ChEMBL
LigandPNGBDBM50442464(CHEMBL2443128)
Affinity DataIC50:  631nM. Assay description: Inhibition of PHD2 (unknown origin) by HTRF assay
In DepthDetails ArticlePubMed