BDBM50442491 CHEMBL2440421
SMILES COc1ccc(cc1)\N=c1/oc2ccccc2cc1C(=O)Nc1ccccn1
InChI Key InChIKey=FSPMMLXJYVKAHF-GYHWCHFESA-N
Data  2 IC50
  Tab Delimited (TSV)   2D SDfile   Computed 3D by Vconf -m prep SDfile
Find this compound or compounds like it in BindingDB:
Activity Spreadsheet -- Enzyme Inhibition Constant Data from BindingDB
Found 2 hits for monomerid = 50442491
TargetAldo-keto reductase family 1 member B10(Homo sapiens (Human))
Gifu Pharmaceutical University
Curated by ChEMBL
LigandPNGBDBM50442491(CHEMBL2440421)
Affinity DataIC50: >1.00E+4nM. Assay description: Inhibition of human recombinant N-terminal His6-tagged AKR1B10 expressed in Escherichia coli by fluorescence assay in presence of NADPH
In DepthDetails ArticlePubMed
TargetAldo-keto reductase family 1 member B1(Homo sapiens (Human))
Gifu Pharmaceutical University
Curated by ChEMBL
LigandPNGBDBM50442491(CHEMBL2440421)
Affinity DataIC50: >1.00E+4nM. Assay description: Inhibition of human recombinant N-terminal His6-tagged AKR1B1 expressed in Escherichia coli by fluorescence assay in presence of NADPH
In DepthDetails ArticlePubMed