BDBM50442597 CHEMBL2441440
SMILES O=C(Cc1ccc(cc1)-n1cnnn1)N1CCN(CCc2ccc3COCc3c2)CC1
InChI Key InChIKey=AAYRYIFNKRSGOF-UHFFFAOYSA-N
Data  1 IC50
  Tab Delimited (TSV)   2D SDfile   Computed 3D by Vconf -m prep SDfile
Find this compound or compounds like it in BindingDB:
Activity Spreadsheet -- Enzyme Inhibition Constant Data from BindingDB
Found 1 hit for monomerid = 50442597
TargetATP-sensitive inward rectifier potassium channel 1(Homo sapiens (Human))
Merck Research Laboratories
Curated by ChEMBL
LigandPNGBDBM50442597(CHEMBL2441440)
Affinity DataIC50:  1.30E+3nM. Assay description: Inhibition of human ROMK channel-mediated 86Rb+ flux expressed in CHO cells after 35 mins by scintillation counting analysis
In DepthDetails ArticlePubMed