BDBM50442774 CHEMBL2443350
SMILES O[C@H]([C@@H](Cn1ccnn1)c1ccccc1)c1ccc(F)cc1
InChI Key InChIKey=QKJRFLUTHQWBPG-IRXDYDNUSA-N
Data  1 KI
  Tab Delimited (TSV)   2D SDfile   Computed 3D by Vconf -m prep SDfile
Find this compound or compounds like it in BindingDB:
Activity Spreadsheet -- Enzyme Inhibition Constant Data from BindingDB
Found 1 hit for monomerid = 50442774
TargetAromatase(Homo sapiens (Human))
Mcmaster University
Curated by ChEMBL
LigandPNGBDBM50442774(CHEMBL2443350)
Affinity DataKi:  330nM. Assay description: Inhibition of recombinant human aromatase using O-dibenzylfluorescein benzyl ester as substrate by fluorometric assay
In DepthDetails ArticlePubMed