BDBM50442854 CHEMBL2441017
SMILES CCOC(=O)C1CCN(CC1)c1ccc(NC(=O)c2oc(nc2C(F)(F)F)N2CCCC2)cn1
InChI Key InChIKey=UQPVBBPTSJJLOR-UHFFFAOYSA-N
Data  1 IC50
  Tab Delimited (TSV)   2D SDfile   Computed 3D by Vconf -m prep SDfile
Find this compound or compounds like it in BindingDB:
Activity Spreadsheet -- Enzyme Inhibition Constant Data from BindingDB
Found 1 hit for monomerid = 50442854
TargetDiacylglycerol O-acyltransferase 1(Homo sapiens (Human))
Merck Research Laboratories
Curated by ChEMBL
LigandPNGBDBM50442854(CHEMBL2441017)
Affinity DataIC50:  1.71E+3nM. Assay description: Inhibition of human DGAT-1 expressed in insect Sf9 cell microsomes using 1,2-dioleoyl-sn-glycerol and [14C]-palmitoyl-CoA as substrate after 2 hrs
In DepthDetails ArticlePubMed